Over a million developers have joined DZone.

Gradle Goodness: Using the Continuous Build Feature

The new continuous build feature in Gradle 2.5 will keep Gradle running to look for changes after tasks are finished.

· DevOps Zone

The DevOps Zone is brought to you in partnership with Sonatype Nexus. The Nexus Suite helps scale your DevOps delivery with continuous component intelligence integrated into development tools, including Eclipse, IntelliJ, Jenkins, Bamboo, SonarQube and more. Schedule a demo today

Gradle introduced the continuous build feature in version 2.5. The feature is still incubating, but we can already use it in our daily development. The continuous build feature means Gradle will not shut down after a task is finished, but keeps running and looks for changes to files to re-run tasks automatically. It applies perfectly for a scenario where we want to re-run the test task while we write our code. With the continuous build feature we start Gradle once with the test task and Gradle will automatically recompile source files and run tests if a source file changes.

To use the continuous build feature we must use the command line option --continuous or the shorter version -t. With this option Gradle will start up in continuous mode. To stop Gradle we must use the Ctrl+D key combination.

In the following output we see how to start Gradle in continuous mode and run the test tasks. The first time our test code fails, we change the source file and without restarting Gradle the file is compiled and the test task is run again. Notice that Gradle will honour the task dependencies to see if files have changed:

$ gradle -t test
Continuous build is an incubating feature.
:compileJava UP-TO-DATE
:compileGroovy
:processResources UP-TO-DATE
:classes
:compileTestJava UP-TO-DATE
:compileTestGroovy
:processTestResources UP-TO-DATE
:testClasses
:test

com.mrhaki.SampleSpec > get message FAILED
org.spockframework.runtime.SpockComparisonFailure at SampleSpec.groovy:7

1 test completed, 1 failed
:test FAILED

FAILURE: Build failed with an exception.

* What went wrong:
Execution failed for task ':test'.
> There were failing tests. See the report at: file:///Users/mrhaki/.../build/reports/tests/index.html

* Try:
Run with --stacktrace option to get the stack trace. Run with --info or --debug option to get more log output.

BUILD FAILED

Total time: 4.464 secs

Waiting for changes to input files of tasks... (ctrl-d to exit)
Change detected, executing build...

:compileJava UP-TO-DATE
:compileGroovy UP-TO-DATE
:processResources UP-TO-DATE
:classes UP-TO-DATE
:compileTestJava UP-TO-DATE
:compileTestGroovy
:processTestResources UP-TO-DATE
:testClasses
:test

BUILD SUCCESSFUL

Total time: 1.792 secs

Waiting for changes to input files of tasks... (ctrl-d to exit)


Written with Gradle 2.6

The DevOps Zone is brought to you in partnership with Sonatype Nexus. Use the Nexus Suite to automate your software supply chain and ensure you're using the highest quality open source components at every step of the development lifecycle. Get Nexus today

Topics:
gradle ,devops ,continuous delivery

Published at DZone with permission of Hubert Klein Ikkink, DZone MVB. See the original article here.

Opinions expressed by DZone contributors are their own.

The best of DZone straight to your inbox.

SEE AN EXAMPLE
Please provide a valid email address.

Thanks for subscribing!

Awesome! Check your inbox to verify your email so you can start receiving the latest in tech news and resources.
Subscribe

{{ parent.title || parent.header.title}}

{{ parent.tldr }}

{{ parent.urlSource.name }}